{"text_format":"1","workbook":"xlsx","n_sheets":11,"sheets":["Welcome","Gantt chart","Example of a Gantt chart","List of deliverable types","Validations","Total project budget","Ex. of individual project","Ex. of collaboration project","List of subsidy rates","Deliverables","Milestones"],"not_rendered":{"charts":0,"images":1,"macros":1,"external_links":0,"defined_names":4,"comments":0,"pivot_tables":0},"unopened":[],"bounds":{"document_bytes":16777216,"sheet_cells":100000,"rows_first":2000,"rows_last":500,"rows_between":2000,"halvings":0,"cell_chars":16384,"cell_head_chars":4096},"cells_cut":0,"cells_raw":0,"read":"whole","date_system":"1900"}

{"sheet":"Welcome","index":0,"n_rows":42,"n_cols":2,"rows_kept":42,"cut":false,"hidden":false,"merged":[[4,1,6,7],[8,1,9,7],[11,1,11,7],[15,1,17,7],[18,1,20,7],[33,1,36,7],[37,1,40,7],[41,1,43,7],[44,1,46,7],[12,1,14,7],[21,1,24,7],[25,1,25,7],[26,1,26,7],[27,1,28,7],[29,1,30,7],[32,1,32,7]]}
[]
[]
[]
[]
[null,"If a yellow bar appears at the top, which asks you to accept macros or ActiveX-objects, you are advised to accept. Otherwise the application form will not work."]
[]
[]
[]
[null,"What type of project are you applying for?"]
[]
[]
[null,"Collaboration projects"]
[null,"Collaboration projects in general have higher rates than individual projects. To achieve an increased rate for collaboration projects, the project must be one of the following: \n \n\n\n\nI samarbejdsprojekter er det et krav, at projektets resultater formidles bredt gennem konferencer, publikationer, open access-samlinger, gratis software eller open source-software. (Dette gælder dog ikke fortrolige oplysninger.)\n"]
[]
[]
[null,"• A collaboration between companies of which at least one is a SME, and where no individual company holds more than 70 percent of the total GUDP subsidy, or;"]
[]
[]
[null,"• A collaboration between companies (regardless of size) and a research and knowledge dissemination institution, where the latter contributes with a co-financing of at least 10 percent of the GUDP subsidy."]
[]
{"$rows_left_out":23}
{"sheet":"Gantt chart","index":1,"n_rows":50,"n_cols":23,"rows_kept":50,"cut":false,"hidden":false,"merged":[[3,2,3,5],[3,6,3,9],[3,10,3,13],[3,14,3,17]]}
[]
["Gantt chart"]
[]
[null,null,"20XX",null,null,null,"20XX",null,null,null,"20XX",null,null,null,"20XX",null,null,null,"Acticity type (F/U/D)"]
[null,"Involved project participants","Jan","Apr","Jul","Oct","Jan","Apr","Jul ","Oct","Jan","Apr","Jul","Oct","Jan","Apr","Jul","Oct","and deliverable type, see list on sheet \"List of deliverable types\"","Number of hours","WP budget"]
["WP 1: Name of WP1"]
["1.1 "]
["1.2"]
["1.3"]
["Etc."]
[]
["Milestones:"]
["M1.1:"]
["M 1.2:",null,null,null,null,null,null,null,null,null,null,null,null,null,null,null,null,null,null,"Total no. of hours:","Total budget:"]
["WP 2"]
["2.1",null,null,null,null,null,null,null,null,null,null,null,null,null,null,null,null,null,null,null,null,null," "]
["2.2"]
["2.3"]
[]
["Milestones:"]
{"$rows_left_out":31}
{"sheet":"Example of a Gantt chart","index":2,"n_rows":62,"n_cols":21,"rows_kept":62,"cut":false,"hidden":false,"merged":[[4,2,4,5],[4,6,4,9],[4,10,4,13],[4,14,4,17]]}
[]
[]
["Example of Gantt chart"]
[]
[null,null,2022,null,null,null,2023,null,null,null,2024,null,null,null,2025,null,null,null,"Activity type (F/U/D)"]
[null,"Involved project participants","Jan","Apr","Jul","Oct","Jan","Apr","Jul ","Oct","Jan","Apr","Jul","Oct","Jan","Apr","Jul","Oct","and delivery type, see Sheet \"List of deliverable types\"","Number of hours","WP budget"]
["WP 1: Planning of research project","Name of responsible (Resp.)",null,null,null,null,null,null,null,null,null,null,null,null,null,null,null,null,"U","No. of hours company 1: 100"]
["1.1: Selection of xxxx","Participant 1",null,null,null,null,null,null,null,null,null,null,null,null,null,null,null,null,null,"No. of hours company 2: 225"]
["1.2: Meetings with relevant professionals","Participant 2"]
["1.3: Total assessment of xxxx","Participant 3"]
[null,"Participant 4"]
["Milestones:"]
["M 1.1: Research set-up",null,"x"]
["M 1.2: Meetings with professionals conducted",null,"x"]
["M 1.3: Internal research-protocol prepared",null,null,null,"UF1","UF3",null,null,null,null,null,null,null,null,null,null,null,null,"UF1 and UF3",null,"Total budget: 210.843 DKK"]
[null,null,null,null,null,null,null,null,null,null,null,null,null,null,null,null,null,null,null,"Total no. of hours: 325","(incl. OH)"]
["WP 2: First study","Name of responsible (Resp.)",null,null,null,null,null,null,null,null,null,null,null,null,null,null,null,null,"F","No. of hours company 1: 160"]
["2.1: Locate suitable herds","Participant 1",null,null,null,null,null,null,null,null,null,null,null,null,null,null,null,null,null,"No. of hours company 2: 310"]
["2.2: Take samples","Participant 2"]
["2.3: Analysis and assessment of xxxx","Participant 3"]
{"$rows_left_out":43}
{"sheet":"List of deliverable types","index":3,"n_rows":53,"n_cols":8,"rows_kept":53,"cut":false,"hidden":false,"merged":[[25,4,25,5],[2,2,2,3],[8,2,8,3],[17,2,17,3],[20,4,20,5],[20,2,20,3],[4,4,4,5],[5,4,5,5],[6,4,6,5],[7,4,7,5],[8,4,8,5],[9,4,9,5],[10,4,10,5],[20,0,20,1],[1,6,1,7],[19,4,19,5],[13,4,13,5],[14,4,14,5],[15,4,15,5],[0,0,0,7],[2,6,2,7],[16,4,16,5],[17,4,17,5],[18,4,18,5],[16,0,16,1],[1,0,1,1],[8,0,8,1],[2,0,2,1],[17,0,17,1],[1,2,1,3],[1,4,1,5],[2,4,2,5],[11,4,11,5],[12,4,12,5],[3,4,3,5]]}
["List of deliverable types and abbrevations to be used when completing the Gantt chart for research, development and demonstration projects"]
["APPLIED RESEARCH",null,"DEVELOPMENT",null,"DEMONSTRATION",null,"NETVÆRK"]
["Scientific production",null,"New products, processes etc.",null,"New products, processes etc.",null,"Leveringstyper"]
["International journal (peer reviewed)","FV1","New or significantly improved product","UP1",null,null,"Potentielle udviklingsarbejder konkretiserede","N1"]
["Danish journal (peer reviewed)","FV2","New or significantly improved production process","UP2",null,null,"Analyser, udredninger, strategier udarbejdet","N2"]
["Proceedings (whole, not single papers) and working papers","FV3","New concepts etc.","UP3",null,null,"Mindre udredninger/ notater udarbejdet","N3"]
["Research report","FV4","Prototypes","UP4",null,null,"Kronikker, avisinterview, debatartikler","N4"]
["Conference presentation incl. paper/abstract/poster (scientific conference)","FV5","Pilot plant","UP5",null,null,"Artikler i fagtidsskrifter eller fagspecifikke aviser","N5"]
["Commercialization and application",null,"Commercialization and application",null,"Commercialization and application",null,"Nyhedsbreve","N6"]
["Patents","FK1","Patents","UK1",null,null,"Hjemmesider tilknyttet til netværket/partnerskabet","N7"]
["-           Novelty study",null,"-           Novelty study",null,null,null,"Andet (beskrives særskilt)","N8"]
["-           Submission of application",null,"-           Submission of application"]
["-           Patent approval",null,"-           Patent approval"]
["-           Agreement on commercial application",null,"-           Agreement on commercial application"]
["Strategic method development and authority procedure","FK2","Trademark protection","UK2"]
["Other type of commercialization","FK3","Certification/test (not required by law)","UK3"]
[null,null,"Other kinds of commercialization, including changes in technical standards, changes in advisory standards etc.","UK4"]
["Software programs",null,"Software programs",null,"Software programs"]
["Internal application","FS1","Internal application","US1"]
["External application","FS2","External application","US2"]
{"$rows_left_out":34}
{"sheet":"Validations","index":4,"n_rows":8,"n_cols":5,"rows_kept":8,"cut":false,"hidden":true,"merged":[]}
[]
[null,"Company size",null,"Activity type:"]
[null,"Individual","Collaboration","Individual","Collaboration"]
[null,"Public research and knowledge dissemination organization","Public research and knowledge dissemination organization","Research","Research"]
[null,"Private research and knowledge dissemination organization","Private research and knowledge dissemination organization","Development","Development"]
[null,"Small company","Small company","Demonstration","Demonstration"]
[null,"Medium-sized company","Medium-sized company"]
[null,"Large company","Large company"]

{"sheet":"Total project budget","index":5,"n_rows":333,"n_cols":17,"rows_kept":333,"cut":false,"hidden":true,"merged":[[302,4,302,5],[318,4,318,5],[14,10,17,13],[222,4,222,5],[238,4,238,5],[254,4,254,5],[270,4,270,5],[286,4,286,5],[142,4,142,5],[158,4,158,5],[174,4,174,5],[190,4,190,5],[206,4,206,5],[62,4,62,5],[78,4,78,5],[94,4,94,5],[1,3,1,4],[3,9,3,11],[4,9,4,11],[110,4,110,5],[126,4,126,5],[46,4,46,5],[14,4,14,5],[30,4,30,5]]}
["Project title:"]
[null,null,null,"Total project budget is filled in automatically"]
[null,"Costs","Of which:                                          GUDP","Of which:                               Independent financing","Of which:                                                   GUDP - manual","Of which:                                                                Other public funding - manual","No. of hours"]
["Salary",{"$f":"B20+B36+B52+B68+B84+B100+B116+B132+B148+B164+B180+B196+B212+B228+B244+B260+B276+B292+B308+B324","v":0},{"$f":"C20+C36+C52+C68+C84+C100+C116+C132+C148+C164+C180+C196+C212+C228+C244+C260+C276+C292+C308+C324","v":0},0,0,0,0,null,null,"Journal no.: 34009-22-XXXX"]
["External assistance",{"$f":"B21+B37+B53+B69+B85+B101+B117+B133+B149+B165+B181+B197+B213+B229+B245+B261+B277+B293+B309+B325","v":0},0,0,0,0,0,null,null,"Approved from: XX-XX-XXXX"]
["Other costs",{"$f":"B22+B38+B54+B70+B86+B102+B118+B134+B150+B166+B182+B198+B214+B230+B246+B262+B278+B294+B310+B326","v":0},0,0,0,0,0]
["Apparatus/equipment",{"$f":"B23+B39+B55+B71+B87+B103+B119+B135+B151+B167+B183+B199+B215+B231+B247+B263+B279+B295+B311+B327","v":0},0,0,0,0,0]
["Scrap value",{"$f":"B24+B40+B56+B72+B88+B104+B120+B136+B152+B168+B184+B200+B216+B232+B248+B264+B280+B296+B312+B328","v":0},0,0,0,0,0]
["Income, if any",{"$f":"B25+B41+B57+B73+B89+B105+B121+B137+B153+B169+B185+B201+B217+B233+B249+B265+B281+B297+B313+B329","v":0},0,0,0,0,0]
["Audit costs",{"$f":"B26+B42+B58+B74+B90+B106+B122+B138+B154+B170+B186+B202+B218+B234+B250+B266+B282+B298+B314+B330","v":0},0,{"$f":"D26+D42+D58+D74+D90+D106+D122+D138+D154+D170+D186+D202+D218+D234+D250+D266+D282+D298+D314+D330","v":0},0,0,0]
["Total excl. OH",{"$f":"B27+B43+B59+B75+B91+B107+B123+B139+B155+B171+B187+B203+B219+B235+B251+B267+B283+B299+B315+B331","v":0},0,0,0,0,0]
["OH",{"$f":"B28+B44+B60+B76+B92+B108+B124+B140+B156+B172+B188+B204+B220+B236+B252+B268+B284+B300+B316+B332","v":0},0,0,0,0,0]
["Total",{"$f":"B29+B45+B61+B77+B93+B109+B125+B141+B157+B173+B189+B205+B221+B237+B253+B269+B285+B301+B317+B333","v":0},0,0,0,0,0]
[]
["Company name:",null,"Main applicant","Company size:",null,null,null,null,null,null,"Use this button to ensure, that you have filled in the data correctly. Red circles mark an error. Remember to look in the budget template to the left and in the grant percentage to the right."]
["Activity type:",null,{"$f":"IF(IF(G16=\"\",E16,G16)=\"\",0,IF(G16=\"\",E16,G16))","v":0},"Maximum subsidy rate:",{"$f":"_xlfn.IFNA(VLOOKUP(B16,'List of subsidy rates'!$A:$K,MATCH(CONCATENATE(E15,\" - \",$H$1),'List of subsidy rates'!$A$1:$K$1,0),FALSE),\"\")","v":""},"Manual subsidy rate:",null,{"$f":"ROUND(IF(E15=\"\",0,IF(LEFT(E15,6)=\"Public\",B27*0.44,B20*0.3)),2)","v":0}]
["OH-percentage",{"$f":"IF(E15=\"\",\"\",IF(E15=\"Public research and knowledge dissemination organization\",0.44,0.3))","v":""},"OH remaining amount",{"$f":"IF(E15=\"\",\"\",IF(LEFT(E15,6)=\"Public\",B27*0.44-B28,B20*0.3-B28))","v":""}]
[]
[{"$f":"IF(B29>0,\"Ja\",\"\")","v":""},"Costs","Of which:                                          GUDP","Of which:                               Independent financing","Of which:                                                   GUDP - manual","Of which:                                                                Other public funding - manual","No. of hours",null,null,"Specification of sub-budget:",null,null,null,null,null,{"$f":"IF(Q29=\"\",\"\",IF(RIGHT(E15,10)=\"Virksomhed\",IF(SUM(Q20:Q28)/COUNT(Q20:Q28)<>Q29,1,\"\"),\"\"))","v":""},"subsidy rate"]
["Salary",null,{"$f":"IFERROR(IF($G$16=\"\",IF(E20=\"\",B20*$E$16,E20),IF(E20=\"\",B20*$G$16,E20)),0)","v":0},{"$f":"IFERROR(B20-C20-F20,0)","v":0},null,null,null,{"$f":"IF(B20=\"\",0,B20)","v":0},{"$f":"IF($E$15<>\"Public research and knowledge dissemination organization\",0,IF(B20=\"\",0,B20))","v":0},null,null,null,null,null,null,{"$f":"A20","v":"Salary"},{"$f":"IFERROR(C20/B20,\"\")","v":""}]
{"$rows_left_out":314}
{"sheet":"Ex. of individual project","index":6,"n_rows":333,"n_cols":17,"rows_kept":333,"cut":false,"hidden":true,"merged":[[318,4,318,5],[142,4,142,5],[158,4,158,5],[174,4,174,5],[190,4,190,5],[206,4,206,5],[222,4,222,5],[238,4,238,5],[254,4,254,5],[270,4,270,5],[286,4,286,5],[302,4,302,5],[126,4,126,5],[1,3,1,4],[3,9,3,11],[4,9,4,11],[14,4,14,5],[14,10,17,13],[30,4,30,5],[46,4,46,5],[62,4,62,5],[78,4,78,5],[94,4,94,5],[110,4,110,5]]}
["Project title:","Example of budget for a company with two acitvity types",null,null,null,null,null,"Individual"]
[null,null,null,"Total project budget is filled in automatically"]
[null,"Costs","Of which:                                          GUDP","Of which:                               Independent financing","Of which:                                                           GUDP - manual","Of which:                                                                Other public funding - manual","No. of hours"]
["Salary ",{"$f":"B20+B36+B52+B68+B84+B100+B116+B132+B148+B164+B180+B196+B212+B228+B244+B260+B276+B292+B308+B324","v":950000},{"$f":"C20+C36+C52+C68+C84+C100+C116+C132+C148+C164+C180+C196+C212+C228+C244+C260+C276+C292+C308+C324","v":452500},497500,0,0,3043,null,null,"Journal no: 34009-22-XXXX"]
["External assistance",16700,{"$f":"C21+C37+C53+C69+C85+C101+C117+C133+C149+C165+C181+C197+C213+C229+C245+C261+C277+C293+C309+C325","v":7515},9185,0,0,0,null,null,"Approved from: XX-XX-XXXX"]
["Other costs",150000,80000,70000,0,0,0]
["Apparatus/equipment",50000,22500,27500,0,0,0]
["Scrap value",-10000,-4500,-5500,0,0,0]
["Income, if any",0,0,0,0,0,0]
["Audit costs",36000,20700,15300,0,0,0]
["Total excl. OH",1192700,578715,613985,0,0,3043]
["OH",285000,135750,149250,0,0,0]
["Total",1477700,714465,763235,0,0,3043]
[]
["Company name:","The Little Green Company","Main applicant","Company size:","Small company",null,null,null,null,null,"Use this button to ensure, that you have filled in the data correctly. Red circles mark an error. Remember to look in the budget-template to the left and in the grant percentage to the right."]
["Activity type:","Development",{"$f":"IF(IF(G16=\"\",E16,G16)=\"\",0,IF(G16=\"\",E16,G16))","v":0.45},"Maximum subsidy rate:",{"$f":"_xlfn.IFNA(VLOOKUP(B16,'List of subsidy rates'!$A:$K,MATCH(CONCATENATE(E15,\" - \",$H$1),'List of subsidy rates'!$A$1:$K$1,0),FALSE),\"\")","v":0.45},"Manual subsidy rate:",null,{"$f":"ROUND(IF(E15=\"\",0,IF(LEFT(E15,6)=\"Public\",B27*0.44,B20*0.3)),2)","v":255000}]
["OH-percentage",{"$f":"IF(E15=\"\",\"\",IF(E15=\"Public research and knowledge dissemination organization\",0.44,0.3))","v":0.3},"OH residual amount",{"$f":"IF(E15=\"\",\"\",IF(LEFT(E15,6)=\"Public\",B27*0.44-B28,B20*0.3-B28))","v":0}]
[]
[null,"Costs","Of which:                                          GUDP","Of which:                               Independent financing","Of which:                                                           GUDP - manual","Of which:                                                                Other public funding - manual","No. of hours",null,null,"Specification of sub-budget:",null,null,null,null,null,{"$f":"IF(Q29=\"\",\"\",IF(RIGHT(E15,10)=\"Virksomhed\",IF(SUM(Q20:Q28)/COUNT(Q20:Q28)<>Q29,1,\"\"),\"\"))","v":""},"subsidy rate"]
["Salary ",850000,{"$f":"IFERROR(IF($G$16=\"\",IF(E20=\"\",B20*$E$16,E20),IF(E20=\"\",B20*$G$16,E20)),0)","v":382500},{"$f":"IFERROR(B20-C20-F20,0)","v":467500},null,null,2730,{"$f":"IF(B20=\"\",0,B20)","v":850000},{"$f":"IF($E$15<>\"Public research and knowledge dissemination organization\",0,IF(B20=\"\",0,B20))","v":0},null,null,null,null,null,null,{"$f":"A20","v":"Salary "},{"$f":"IFERROR(C20/B20,\"\")","v":0.45}]
{"$rows_left_out":314}
{"sheet":"Ex. of collaboration project","index":7,"n_rows":333,"n_cols":17,"rows_kept":333,"cut":false,"hidden":true,"merged":[[318,4,318,5],[142,4,142,5],[158,4,158,5],[174,4,174,5],[190,4,190,5],[206,4,206,5],[222,4,222,5],[238,4,238,5],[254,4,254,5],[270,4,270,5],[286,4,286,5],[302,4,302,5],[126,4,126,5],[1,3,1,4],[3,9,3,11],[4,9,4,11],[14,4,14,5],[14,10,17,13],[30,4,30,5],[46,4,46,5],[62,4,62,5],[78,4,78,5],[94,4,94,5],[110,4,110,5]]}
["Project title:","Example of collaboration project with 3 participants",null,null,null,null,null,"Collaboration"]
[null,null,null,"Total project budget is filled in automatically"]
[null,"Costs","Of which:                                          GUDP","Of which:                               Independent financing","Of which:                                                           GUDP - manual","Of which:                                                                Other public funding - manual","No. of hours"]
["Salary ",{"$f":"B20+B36+B52+B68+B84+B100+B116+B132+B148+B164+B180+B196+B212+B228+B244+B260+B276+B292+B308+B324","v":2900000},{"$f":"C20+C36+C52+C68+C84+C100+C116+C132+C148+C164+C180+C196+C212+C228+C244+C260+C276+C292+C308+C324","v":2410000},430000,1750000,60000,7769,null,null,"Journal no: 34009-22-XXXX"]
["External assistance",30000,{"$f":"C21+C37+C53+C69+C85+C101+C117+C133+C149+C165+C181+C197+C213+C229+C245+C261+C277+C293+C309+C325","v":18000},12000,0,0,0,null,null,"Approved from: XX-XX-XXXX"]
["Other costs",400000,145000,55000,50000,200000,0]
["Apparatus/equipment",50000,30000,20000,0,0,0]
["Scrap value",-10000,-6000,-4000,0,0,0]
["Income, if any",0,0,0,0,0,0]
["Audit costs",52000,29800,17400,0,4800,0]
["Total excl. OH",3422000,2626800,530400,1800000,264800,7769]
["OH",1225000,990000,129000,792000,106000,0]
["Total",4647000,3616800,659400,2592000,370800,7769]
[]
["Company name:","The Little Green Company","Main applicant","Company size:","Small company",null,null,null,null,null,"Use this button to ensure, that you have filled in the data correctly. Red circles mark an error. Remember to look in the budget-template to the left and in the grant percentage to the right."]
["Activity type:","Development",{"$f":"IF(IF(G16=\"\",E16,G16)=\"\",0,IF(G16=\"\",E16,G16))","v":0.6},"Maximum subsidy rate:",{"$f":"_xlfn.IFNA(VLOOKUP(B16,'List of subsidy rates'!$A:$K,MATCH(CONCATENATE(E15,\" - \",$H$1),'List of subsidy rates'!$A$1:$K$1,0),FALSE),\"\")","v":0.6},"Manual subsidy rate:",null,{"$f":"ROUND(IF(E15=\"\",0,IF(LEFT(E15,6)=\"Public\",B27*0.44,B20*0.3)),2)","v":255000}]
["OH-percentage",{"$f":"IF(E15=\"\",\"\",IF(E15=\"Public research and knowledge dissemination organization\",0.44,0.3))","v":0.3},"OH residual amount",{"$f":"IF(E15=\"\",\"\",IF(LEFT(E15,6)=\"Public\",B27*0.44-B28,B20*0.3-B28))","v":0}]
[]
[null,"Costs","Of which:                                          GUDP","Of which:                               Independent financing","Of which:                                                           GUDP - manual","Of which:                                                                Other public funding - manual","No. of hours",null,null,"Specification of sub-budget",null,null,null,null,null,{"$f":"IF(Q29=\"\",\"\",IF(RIGHT(E15,10)=\"Virksomhed\",IF(SUM(Q20:Q28)/COUNT(Q20:Q28)<>Q29,1,\"\"),\"\"))","v":""},"subsidy rate"]
["Salary ",850000,{"$f":"IFERROR(IF($G$16=\"\",IF(E20=\"\",B20*$E$16,E20),IF(E20=\"\",B20*$G$16,E20)),0)","v":510000},{"$f":"IFERROR(B20-C20-F20,0)","v":340000},null,null,2730,{"$f":"IF(B20=\"\",0,B20)","v":850000},{"$f":"IF($E$15<>\"Public research and knowledge dissemination organization\",0,IF(B20=\"\",0,B20))","v":0},null,null,null,null,null,null,{"$f":"A20","v":"Salary "},{"$f":"IFERROR(C20/B20,\"\")","v":0.6}]
{"$rows_left_out":314}
{"sheet":"List of subsidy rates","index":8,"n_rows":6,"n_cols":11,"rows_kept":6,"cut":false,"hidden":false,"merged":[]}
[null,"Public research and knowledge dissemination organization - Individual","Public research and knowledge dissemination organization - Collaboration","Private research and knowledge dissemination organization - Individual","Private research and knowledge dissemination organization - Collaboration","Small company - Individual","Small company - Collaboration","Medium-sized company - Individual","Medium-sized company - Collaboration","Large company - Individual","Large company - Collaboration"]
["Research",0.5,0.9,0.5,0.65,0.9,0.8,0.6,0.75,0.5,0.65]
["Development",0.25,0.9,0.25,0.4,0.45,0.6,0.35,0.5,0.25,0.4]
["Demonstration",0.7,0.7,0.7,0.7,0.7,0.7,0.7,0.7,0.7,0.7]
["*Companies are not allowed co-financing with other public funds"]
["*Public research and knowledge dissemination organizations are not allowed co-financing with own funds"]

{"sheet":"Deliverables","index":9,"n_rows":10,"n_cols":10,"rows_kept":10,"cut":false,"hidden":false,"merged":[]}
[null,null,"Acronym:",null,null,null,"Org RDD 9","Individual"]
[null,null,null,null,"Delete red-highlighted text."]
["Work package","Task","Deliverable no.","Type of\ndeliverable 2\n(from the application's  Gantt-chart)","Title of deliverable","Type (e.g. video, scientific article, press release, field day)","Target group - who is the communication material aimed at?","Through which communication channel will you reach the target group?","When? (Expected delivery date)","Responsible project participant"]
[1,1,"D1.1.1","FV1","E.g. \"Impact of rooting areas on hygiene in pig pens\"","\"Peer reviewed scientific article\"","Research community","Scientific journal of cows and pigs"]
[1,1,"D1.1.2","FV5","E.g. \"Influence of feed additives on the gastrointestinal flora\"","Presentation at scientific conference","Research community","Cow and pig scientific conference"]
[2,1,"D.2.1.1","FF3","E.g. \"The Economy of extracting Grass Protein\"","Popular science article","Primary producers & advisors","Økologisk Landbrug [Organic Agriculture] (newspaper)"]
[2,1,"D2.1.2","FF5","E.g. \"Recommendations for improved cow-calf systems\"","Presentation","Primary producers & advisors","Økologi-Kongressen [The Orgainc Congress]"]
[2,2,"D2.2.1","UP1","E.g. \"Green manure extracted from grass, a new product\"","Internal report","Project participants","Project meeting"]
[3,1,"D3.1.1","UF2","E.g. \"Recommendations for the prevention of diarrhea in piglets\"","Report on the prevention of diarrhea in piglets","Primary producers & advisors","DCA report"]
[3,1,"D3.1.2","DF2","E.g. \"Guidance on the use of mechanical weed treatment in fruit orchards\"","Book","Primary producers & advisors","Website, social media, direct mail"]

{"sheet":"Milestones","index":10,"n_rows":7,"n_cols":9,"rows_kept":7,"cut":false,"hidden":false,"merged":[]}
[null,null,"Acronym:",null,null,"Org RDD 9",null,"Individuel"]
[null,null,null,"Delete red-highlighted text."]
["Work package","Task","Milestone no.\n","Title (from application and if changed)","Responsible project participant\n(from application and if changed)","Date milestone is expected to be reached according to application","Planned date for milestone, if changed","Actual date where milestone is reached","Fulfilled (OK) or Changes (D)"]
[1,"1.1","M.1.1.2","Eg. \"Experiments brought\", \"Experiment results collected\", \"Manufacturers interviewed\"; \"Experimental protocol prepared\", \"Internal workshop held\" etc."]
[1,1,"M1.1.2"]
[1,2,"M1.2.1"]
[2,1,"M2.1.1"]